Build results for nightly-2026-10-20, target riscv32imafc-esp-espidf (std)

Home

🔔 does-it-build supports sending notifications to target maintainers via GitHub issues. You can add yourself with a PR. 🔔

error

Build date: 2026-10-20T03:41:53.969Z

Build duration: 57.616s

Builder does-it-build commit: 5686e011fa029dd9

   Compiling compiler_builtins v0.1.160 (/var/lib/does-it-build/.rustup/toolchains/nightly-2026-10-20-x86_64-unknown-linux-gnu/lib/rustlib/src/rust/library/compiler-builtins/compiler-builtins)
   Compiling core v0.0.0 (/var/lib/does-it-build/.rustup/toolchains/nightly-2026-10-20-x86_64-unknown-linux-gnu/lib/rustlib/src/rust/library/core)
   Compiling rustc-std-workspace-core v1.99.0 (/var/lib/does-it-build/.rustup/toolchains/nightly-2026-10-20-x86_64-unknown-linux-gnu/lib/rustlib/src/rust/library/rustc-std-workspace-core)
   Compiling alloc v0.0.0 (/var/lib/does-it-build/.rustup/toolchains/nightly-2026-10-20-x86_64-unknown-linux-gnu/lib/rustlib/src/rust/library/alloc)
   Compiling rustc-std-workspace-alloc v1.99.0 (/var/lib/does-it-build/.rustup/toolchains/nightly-2026-10-20-x86_64-unknown-linux-gnu/lib/rustlib/src/rust/library/rustc-std-workspace-alloc)
   Compiling libc v0.2.191
   Compiling object v0.39.1
   Compiling unwind v0.0.0 (/var/lib/does-it-build/.rustup/toolchains/nightly-2026-10-20-x86_64-unknown-linux-gnu/lib/rustlib/src/rust/library/unwind)
   Compiling gimli v0.34.0
   Compiling memchr v2.8.3
   Compiling adler2 v2.0.1
   Compiling std v0.0.0 (/var/lib/does-it-build/.rustup/toolchains/nightly-2026-10-20-x86_64-unknown-linux-gnu/lib/rustlib/src/rust/library/std)
   Compiling miniz_oxide v0.9.1
   Compiling addr2line v0.27.1
   Compiling panic_unwind v0.0.0 (/var/lib/does-it-build/.rustup/toolchains/nightly-2026-10-20-x86_64-unknown-linux-gnu/lib/rustlib/src/rust/library/panic_unwind)
   Compiling std_detect v0.1.5 (/var/lib/does-it-build/.rustup/toolchains/nightly-2026-10-20-x86_64-unknown-linux-gnu/lib/rustlib/src/rust/library/std_detect)
   Compiling hashbrown v0.17.1
   Compiling panic_abort v0.0.0 (/var/lib/does-it-build/.rustup/toolchains/nightly-2026-10-20-x86_64-unknown-linux-gnu/lib/rustlib/src/rust/library/panic_abort)
   Compiling cfg-if v1.0.4
   Compiling rustc-demangle v0.1.28
error[E0609]: no field `st_atime` on type `&libc::stat`
  --> /var/lib/does-it-build/.rustup/toolchains/nightly-2026-10-20-x86_64-unknown-linux-gnu/lib/rustlib/src/rust/library/std/src/os/espidf/fs.rs:89:36
   |
89 |         self.as_inner().as_inner().st_atime as i64
   |                                    ^^^^^^^^ unknown field
   |
help: a field with a similar name exists
   |
89 -         self.as_inner().as_inner().st_atime as i64
89 +         self.as_inner().as_inner().st_atim as i64
   |

error[E0609]: no field `st_mtime` on type `&libc::stat`
  --> /var/lib/does-it-build/.rustup/toolchains/nightly-2026-10-20-x86_64-unknown-linux-gnu/lib/rustlib/src/rust/library/std/src/os/espidf/fs.rs:95:36
   |
95 |         self.as_inner().as_inner().st_mtime as i64
   |                                    ^^^^^^^^ unknown field
   |
help: a field with a similar name exists
   |
95 -         self.as_inner().as_inner().st_mtime as i64
95 +         self.as_inner().as_inner().st_mtim as i64
   |

error[E0609]: no field `st_ctime` on type `&libc::stat`
   --> /var/lib/does-it-build/.rustup/toolchains/nightly-2026-10-20-x86_64-unknown-linux-gnu/lib/rustlib/src/rust/library/std/src/os/espidf/fs.rs:101:36
    |
101 |         self.as_inner().as_inner().st_ctime as i64
    |                                    ^^^^^^^^ unknown field
    |
help: a field with a similar name exists
    |
101 -         self.as_inner().as_inner().st_ctime as i64
101 +         self.as_inner().as_inner().st_ctim as i64
    |

error[E0609]: no field `st_mtime` on type `libc::stat`
   --> /var/lib/does-it-build/.rustup/toolchains/nightly-2026-10-20-x86_64-unknown-linux-gnu/lib/rustlib/src/rust/library/std/src/sys/fs/unix.rs:605:35
    |
605 |         SystemTime::new(self.stat.st_mtime as i64, 0)
    |                                   ^^^^^^^^ unknown field
    |
help: a field with a similar name exists
    |
605 -         SystemTime::new(self.stat.st_mtime as i64, 0)
605 +         SystemTime::new(self.stat.st_mtim as i64, 0)
    |

error[E0609]: no field `st_atime` on type `libc::stat`
   --> /var/lib/does-it-build/.rustup/toolchains/nightly-2026-10-20-x86_64-unknown-linux-gnu/lib/rustlib/src/rust/library/std/src/sys/fs/unix.rs:645:35
    |
645 |         SystemTime::new(self.stat.st_atime as i64, 0)
    |                                   ^^^^^^^^ unknown field
    |
help: a field with a similar name exists
    |
645 -         SystemTime::new(self.stat.st_atime as i64, 0)
645 +         SystemTime::new(self.stat.st_atim as i64, 0)
    |

For more information about this error, try `rustc --explain E0609`.
error: could not compile `std` (lib) due to 5 previous errors

    

Build history for target riscv32imafc-esp-espidf

Build state for nightly 2026-10-20