Build results for nightly-2026-10-18, target x86_64-unknown-motor (std)

Home

🔔 does-it-build supports sending notifications to target maintainers via GitHub issues. You can add yourself with a PR. 🔔

error

Build date: 2026-10-18T04:16:39.17Z

Build duration: 62.366s

Builder does-it-build commit: 5686e011fa029dd9

   Compiling compiler_builtins v0.1.160 (/var/lib/does-it-build/.rustup/toolchains/nightly-2026-10-18-x86_64-unknown-linux-gnu/lib/rustlib/src/rust/library/compiler-builtins/compiler-builtins)
   Compiling core v0.0.0 (/var/lib/does-it-build/.rustup/toolchains/nightly-2026-10-18-x86_64-unknown-linux-gnu/lib/rustlib/src/rust/library/core)
   Compiling rustc-std-workspace-core v1.99.0 (/var/lib/does-it-build/.rustup/toolchains/nightly-2026-10-18-x86_64-unknown-linux-gnu/lib/rustlib/src/rust/library/rustc-std-workspace-core)
   Compiling alloc v0.0.0 (/var/lib/does-it-build/.rustup/toolchains/nightly-2026-10-18-x86_64-unknown-linux-gnu/lib/rustlib/src/rust/library/alloc)
   Compiling rustc-std-workspace-alloc v1.99.0 (/var/lib/does-it-build/.rustup/toolchains/nightly-2026-10-18-x86_64-unknown-linux-gnu/lib/rustlib/src/rust/library/rustc-std-workspace-alloc)
   Compiling libc v0.2.189
   Compiling object v0.39.1
   Compiling unwind v0.0.0 (/var/lib/does-it-build/.rustup/toolchains/nightly-2026-10-18-x86_64-unknown-linux-gnu/lib/rustlib/src/rust/library/unwind)
   Compiling gimli v0.34.0
   Compiling adler2 v2.0.1
   Compiling memchr v2.8.3
   Compiling std v0.0.0 (/var/lib/does-it-build/.rustup/toolchains/nightly-2026-10-18-x86_64-unknown-linux-gnu/lib/rustlib/src/rust/library/std)
   Compiling miniz_oxide v0.9.1
   Compiling addr2line v0.27.1
   Compiling panic_unwind v0.0.0 (/var/lib/does-it-build/.rustup/toolchains/nightly-2026-10-18-x86_64-unknown-linux-gnu/lib/rustlib/src/rust/library/panic_unwind)
   Compiling std_detect v0.1.5 (/var/lib/does-it-build/.rustup/toolchains/nightly-2026-10-18-x86_64-unknown-linux-gnu/lib/rustlib/src/rust/library/std_detect)
   Compiling moto-rt v0.17.4
   Compiling hashbrown v0.17.1
   Compiling panic_abort v0.0.0 (/var/lib/does-it-build/.rustup/toolchains/nightly-2026-10-18-x86_64-unknown-linux-gnu/lib/rustlib/src/rust/library/panic_abort)
   Compiling rustc-demangle v0.1.28
   Compiling cfg-if v1.0.4
error[E0599]: no method named `set_hop_limit_v6` found for struct `connection::motor::TcpStream` in the current scope
   --> /var/lib/does-it-build/.rustup/toolchains/nightly-2026-10-18-x86_64-unknown-linux-gnu/lib/rustlib/src/rust/library/std/src/net/tcp.rs:625:16
    |
625 |         self.0.set_hop_limit_v6(limit)
    |                ^^^^^^^^^^^^^^^^ method not found in `connection::motor::TcpStream`
    |
   ::: /var/lib/does-it-build/.rustup/toolchains/nightly-2026-10-18-x86_64-unknown-linux-gnu/lib/rustlib/src/rust/library/std/src/sys/net/connection/motor.rs:17:1
    |
 17 | pub struct TcpStream {
    | -------------------- method `set_hop_limit_v6` not found for this struct

error[E0599]: no method named `hop_limit_v6` found for struct `connection::motor::TcpStream` in the current scope
   --> /var/lib/does-it-build/.rustup/toolchains/nightly-2026-10-18-x86_64-unknown-linux-gnu/lib/rustlib/src/rust/library/std/src/net/tcp.rs:645:16
    |
645 |         self.0.hop_limit_v6()
    |                ^^^^^^^^^^^^ method not found in `connection::motor::TcpStream`
    |
   ::: /var/lib/does-it-build/.rustup/toolchains/nightly-2026-10-18-x86_64-unknown-linux-gnu/lib/rustlib/src/rust/library/std/src/sys/net/connection/motor.rs:17:1
    |
 17 | pub struct TcpStream {
    | -------------------- method `hop_limit_v6` not found for this struct

error[E0599]: no method named `set_hop_limit_v6` found for struct `connection::motor::TcpListener` in the current scope
    --> /var/lib/does-it-build/.rustup/toolchains/nightly-2026-10-18-x86_64-unknown-linux-gnu/lib/rustlib/src/rust/library/std/src/net/tcp.rs:1091:16
     |
1091 |         self.0.set_hop_limit_v6(limit)
     |                ^^^^^^^^^^^^^^^^
     |
    ::: /var/lib/does-it-build/.rustup/toolchains/nightly-2026-10-18-x86_64-unknown-linux-gnu/lib/rustlib/src/rust/library/std/src/sys/net/connection/motor.rs:166:1
     |
 166 | pub struct TcpListener {
     | ---------------------- method `set_hop_limit_v6` not found for this struct
     |
help: there is a method `set_only_v6` with a similar name
     |
1091 -         self.0.set_hop_limit_v6(limit)
1091 +         self.0.set_only_v6(limit)
     |

error[E0599]: no method named `hop_limit_v6` found for struct `connection::motor::TcpListener` in the current scope
    --> /var/lib/does-it-build/.rustup/toolchains/nightly-2026-10-18-x86_64-unknown-linux-gnu/lib/rustlib/src/rust/library/std/src/net/tcp.rs:1110:16
     |
1110 |         self.0.hop_limit_v6()
     |                ^^^^^^^^^^^^ method not found in `connection::motor::TcpListener`
     |
    ::: /var/lib/does-it-build/.rustup/toolchains/nightly-2026-10-18-x86_64-unknown-linux-gnu/lib/rustlib/src/rust/library/std/src/sys/net/connection/motor.rs:166:1
     |
 166 | pub struct TcpListener {
     | ---------------------- method `hop_limit_v6` not found for this struct

error[E0599]: no method named `set_hop_limit_v6` found for struct `connection::motor::UdpSocket` in the current scope
   --> /var/lib/does-it-build/.rustup/toolchains/nightly-2026-10-18-x86_64-unknown-linux-gnu/lib/rustlib/src/rust/library/std/src/net/udp.rs:608:16
    |
608 |         self.0.set_hop_limit_v6(limit)
    |                ^^^^^^^^^^^^^^^^ method not found in `connection::motor::UdpSocket`
    |
   ::: /var/lib/does-it-build/.rustup/toolchains/nightly-2026-10-18-x86_64-unknown-linux-gnu/lib/rustlib/src/rust/library/std/src/sys/net/connection/motor.rs:235:1
    |
235 | pub struct UdpSocket {
    | -------------------- method `set_hop_limit_v6` not found for this struct

error[E0599]: no method named `hop_limit_v6` found for struct `connection::motor::UdpSocket` in the current scope
   --> /var/lib/does-it-build/.rustup/toolchains/nightly-2026-10-18-x86_64-unknown-linux-gnu/lib/rustlib/src/rust/library/std/src/net/udp.rs:627:16
    |
627 |         self.0.hop_limit_v6()
    |                ^^^^^^^^^^^^ method not found in `connection::motor::UdpSocket`
    |
   ::: /var/lib/does-it-build/.rustup/toolchains/nightly-2026-10-18-x86_64-unknown-linux-gnu/lib/rustlib/src/rust/library/std/src/sys/net/connection/motor.rs:235:1
    |
235 | pub struct UdpSocket {
    | -------------------- method `hop_limit_v6` not found for this struct

error[E0599]: no method named `set_multicast_hop_limit_v6` found for struct `connection::motor::UdpSocket` in the current scope
   --> /var/lib/does-it-build/.rustup/toolchains/nightly-2026-10-18-x86_64-unknown-linux-gnu/lib/rustlib/src/rust/library/std/src/net/udp.rs:646:16
    |
646 |         self.0.set_multicast_hop_limit_v6(limit)
    |                ^^^^^^^^^^^^^^^^^^^^^^^^^^
    |
   ::: /var/lib/does-it-build/.rustup/toolchains/nightly-2026-10-18-x86_64-unknown-linux-gnu/lib/rustlib/src/rust/library/std/src/sys/net/connection/motor.rs:235:1
    |
235 | pub struct UdpSocket {
    | -------------------- method `set_multicast_hop_limit_v6` not found for this struct
    |
help: there is a method `set_multicast_loop_v6` with a similar name
    |
646 -         self.0.set_multicast_hop_limit_v6(limit)
646 +         self.0.set_multicast_loop_v6(limit)
    |

error[E0599]: no method named `multicast_hop_limit_v6` found for struct `connection::motor::UdpSocket` in the current scope
   --> /var/lib/does-it-build/.rustup/toolchains/nightly-2026-10-18-x86_64-unknown-linux-gnu/lib/rustlib/src/rust/library/std/src/net/udp.rs:665:16
    |
665 |         self.0.multicast_hop_limit_v6()
    |                ^^^^^^^^^^^^^^^^^^^^^^
    |
   ::: /var/lib/does-it-build/.rustup/toolchains/nightly-2026-10-18-x86_64-unknown-linux-gnu/lib/rustlib/src/rust/library/std/src/sys/net/connection/motor.rs:235:1
    |
235 | pub struct UdpSocket {
    | -------------------- method `multicast_hop_limit_v6` not found for this struct
    |
help: there is a method `multicast_loop_v6` with a similar name
    |
665 -         self.0.multicast_hop_limit_v6()
665 +         self.0.multicast_loop_v6()
    |

For more information about this error, try `rustc --explain E0599`.
error: could not compile `std` (lib) due to 8 previous errors

    

Build history for target x86_64-unknown-motor

Build state for nightly 2026-10-18