🔔 does-it-build supports sending notifications to target maintainers via GitHub issues. You can add yourself with a PR. 🔔
Build date: 2026-10-18T02:13:27.65Z
Build duration: 63.437s
Builder does-it-build commit: 5686e011fa029dd9
Compiling compiler_builtins v0.1.160 (/var/lib/does-it-build/.rustup/toolchains/nightly-2026-10-18-x86_64-unknown-linux-gnu/lib/rustlib/src/rust/library/compiler-builtins/compiler-builtins)
Compiling core v0.0.0 (/var/lib/does-it-build/.rustup/toolchains/nightly-2026-10-18-x86_64-unknown-linux-gnu/lib/rustlib/src/rust/library/core)
Compiling rustc-std-workspace-core v1.99.0 (/var/lib/does-it-build/.rustup/toolchains/nightly-2026-10-18-x86_64-unknown-linux-gnu/lib/rustlib/src/rust/library/rustc-std-workspace-core)
Compiling alloc v0.0.0 (/var/lib/does-it-build/.rustup/toolchains/nightly-2026-10-18-x86_64-unknown-linux-gnu/lib/rustlib/src/rust/library/alloc)
Compiling rustc-std-workspace-alloc v1.99.0 (/var/lib/does-it-build/.rustup/toolchains/nightly-2026-10-18-x86_64-unknown-linux-gnu/lib/rustlib/src/rust/library/rustc-std-workspace-alloc)
Compiling libc v0.2.189
Compiling object v0.39.1
Compiling unwind v0.0.0 (/var/lib/does-it-build/.rustup/toolchains/nightly-2026-10-18-x86_64-unknown-linux-gnu/lib/rustlib/src/rust/library/unwind)
Compiling gimli v0.34.0
Compiling adler2 v2.0.1
Compiling memchr v2.8.3
Compiling std v0.0.0 (/var/lib/does-it-build/.rustup/toolchains/nightly-2026-10-18-x86_64-unknown-linux-gnu/lib/rustlib/src/rust/library/std)
Compiling miniz_oxide v0.9.1
Compiling addr2line v0.27.1
Compiling panic_unwind v0.0.0 (/var/lib/does-it-build/.rustup/toolchains/nightly-2026-10-18-x86_64-unknown-linux-gnu/lib/rustlib/src/rust/library/panic_unwind)
Compiling std_detect v0.1.5 (/var/lib/does-it-build/.rustup/toolchains/nightly-2026-10-18-x86_64-unknown-linux-gnu/lib/rustlib/src/rust/library/std_detect)
Compiling hashbrown v0.17.1
Compiling panic_abort v0.0.0 (/var/lib/does-it-build/.rustup/toolchains/nightly-2026-10-18-x86_64-unknown-linux-gnu/lib/rustlib/src/rust/library/panic_abort)
Compiling rustc-demangle v0.1.28
Compiling cfg-if v1.0.4
error[E0425]: cannot find value `IPV6_UNICAST_HOPS` in module `c`
--> /var/lib/does-it-build/.rustup/toolchains/nightly-2026-10-18-x86_64-unknown-linux-gnu/lib/rustlib/src/rust/library/std/src/sys/net/connection/socket/mod.rs:534:61
|
534 | setsockopt(&self.inner, c::IPPROTO_IPV6, c::IPV6_UNICAST_HOPS, limit as c_int)
| ^^^^^^^^^^^^^^^^^ not found in `c`
error[E0425]: cannot find value `IPV6_UNICAST_HOPS` in module `c`
--> /var/lib/does-it-build/.rustup/toolchains/nightly-2026-10-18-x86_64-unknown-linux-gnu/lib/rustlib/src/rust/library/std/src/sys/net/connection/socket/mod.rs:546:74
|
546 | unsafe { getsockopt(&self.inner, c::IPPROTO_IPV6, c::IPV6_UNICAST_HOPS)? };
| ^^^^^^^^^^^^^^^^^ not found in `c`
error[E0425]: cannot find value `IPV6_UNICAST_HOPS` in module `c`
--> /var/lib/does-it-build/.rustup/toolchains/nightly-2026-10-18-x86_64-unknown-linux-gnu/lib/rustlib/src/rust/library/std/src/sys/net/connection/socket/mod.rs:687:61
|
687 | setsockopt(&self.inner, c::IPPROTO_IPV6, c::IPV6_UNICAST_HOPS, limit as c_int)
| ^^^^^^^^^^^^^^^^^ not found in `c`
error[E0425]: cannot find value `IPV6_UNICAST_HOPS` in module `c`
--> /var/lib/does-it-build/.rustup/toolchains/nightly-2026-10-18-x86_64-unknown-linux-gnu/lib/rustlib/src/rust/library/std/src/sys/net/connection/socket/mod.rs:699:74
|
699 | unsafe { getsockopt(&self.inner, c::IPPROTO_IPV6, c::IPV6_UNICAST_HOPS)? };
| ^^^^^^^^^^^^^^^^^ not found in `c`
error[E0425]: cannot find value `EMSGSIZE` in module `c`
--> /var/lib/does-it-build/.rustup/toolchains/nightly-2026-10-18-x86_64-unknown-linux-gnu/lib/rustlib/src/rust/library/std/src/sys/net/connection/socket/mod.rs:790:56
|
790 | return Err(io::Error::from_raw_os_error(c::EMSGSIZE));
| ^^^^^^^^ not found in `c`
|
help: consider importing this constant
|
5 + use libc::EMSGSIZE;
|
help: if you import `EMSGSIZE`, refer to it directly
|
790 - return Err(io::Error::from_raw_os_error(c::EMSGSIZE));
790 + return Err(io::Error::from_raw_os_error(EMSGSIZE));
|
error[E0425]: cannot find value `IPV6_UNICAST_HOPS` in module `c`
--> /var/lib/does-it-build/.rustup/toolchains/nightly-2026-10-18-x86_64-unknown-linux-gnu/lib/rustlib/src/rust/library/std/src/sys/net/connection/socket/mod.rs:932:61
|
932 | setsockopt(&self.inner, c::IPPROTO_IPV6, c::IPV6_UNICAST_HOPS, limit as c_int)
| ^^^^^^^^^^^^^^^^^ not found in `c`
error[E0425]: cannot find value `IPV6_UNICAST_HOPS` in module `c`
--> /var/lib/does-it-build/.rustup/toolchains/nightly-2026-10-18-x86_64-unknown-linux-gnu/lib/rustlib/src/rust/library/std/src/sys/net/connection/socket/mod.rs:944:74
|
944 | unsafe { getsockopt(&self.inner, c::IPPROTO_IPV6, c::IPV6_UNICAST_HOPS)? };
| ^^^^^^^^^^^^^^^^^ not found in `c`
error[E0425]: cannot find value `IPV6_MULTICAST_HOPS` in module `c`
--> /var/lib/does-it-build/.rustup/toolchains/nightly-2026-10-18-x86_64-unknown-linux-gnu/lib/rustlib/src/rust/library/std/src/sys/net/connection/socket/mod.rs:957:61
|
957 | setsockopt(&self.inner, c::IPPROTO_IPV6, c::IPV6_MULTICAST_HOPS, limit as c_int)
| ^^^^^^^^^^^^^^^^^^^ not found in `c`
|
note: similarly named constant `IPV6_MULTICAST_LOOP` defined here
--> /var/lib/does-it-build/.rustup/toolchains/nightly-2026-10-18-x86_64-unknown-linux-gnu/lib/rustlib/src/rust/library/std/src/sys/pal/solid/abi/sockets.rs:15:1
|
15 | pub const IPV6_MULTICAST_LOOP: i32 = 19;
| ^^^^^^^^^^^^^^^^^^^^^^^^^^^^^^^^^^^^^^^^
help: a constant with a similar name exists
|
957 - setsockopt(&self.inner, c::IPPROTO_IPV6, c::IPV6_MULTICAST_HOPS, limit as c_int)
957 + setsockopt(&self.inner, c::IPPROTO_IPV6, c::IPV6_MULTICAST_LOOP, limit as c_int)
|
error[E0425]: cannot find value `IPV6_MULTICAST_HOPS` in module `c`
--> /var/lib/does-it-build/.rustup/toolchains/nightly-2026-10-18-x86_64-unknown-linux-gnu/lib/rustlib/src/rust/library/std/src/sys/net/connection/socket/mod.rs:969:74
|
969 | unsafe { getsockopt(&self.inner, c::IPPROTO_IPV6, c::IPV6_MULTICAST_HOPS)? };
| ^^^^^^^^^^^^^^^^^^^ not found in `c`
|
note: similarly named constant `IPV6_MULTICAST_LOOP` defined here
--> /var/lib/does-it-build/.rustup/toolchains/nightly-2026-10-18-x86_64-unknown-linux-gnu/lib/rustlib/src/rust/library/std/src/sys/pal/solid/abi/sockets.rs:15:1
|
15 | pub const IPV6_MULTICAST_LOOP: i32 = 19;
| ^^^^^^^^^^^^^^^^^^^^^^^^^^^^^^^^^^^^^^^^
help: a constant with a similar name exists
|
969 - unsafe { getsockopt(&self.inner, c::IPPROTO_IPV6, c::IPV6_MULTICAST_HOPS)? };
969 + unsafe { getsockopt(&self.inner, c::IPPROTO_IPV6, c::IPV6_MULTICAST_LOOP)? };
|
error[E0425]: cannot find value `EMSGSIZE` in module `c`
--> /var/lib/does-it-build/.rustup/toolchains/nightly-2026-10-18-x86_64-unknown-linux-gnu/lib/rustlib/src/rust/library/std/src/sys/net/connection/socket/mod.rs:993:56
|
993 | return Err(io::Error::from_raw_os_error(c::EMSGSIZE));
| ^^^^^^^^ not found in `c`
|
help: consider importing this constant
|
5 + use libc::EMSGSIZE;
|
help: if you import `EMSGSIZE`, refer to it directly
|
993 - return Err(io::Error::from_raw_os_error(c::EMSGSIZE));
993 + return Err(io::Error::from_raw_os_error(EMSGSIZE));
|
For more information about this error, try `rustc --explain E0425`.
error: could not compile `std` (lib) due to 10 previous errors