Build results for nightly-2024-08-02 target armv5te-unknown-linux-uclibceabi miri-std

error
Preparing a sysroot for Miri (target: armv5te-unknown-linux-uclibceabi)...
warning: no edition set: defaulting to the 2015 edition while the latest is 2021
    Blocking waiting for file lock on package cache
    Blocking waiting for file lock on package cache
    Blocking waiting for file lock on package cache
   Compiling compiler_builtins v0.1.114
    Checking core v0.0.0 (/home/nora/.rustup/toolchains/nightly-2024-08-02-x86_64-unknown-linux-gnu/lib/rustlib/src/rust/library/core)
   Compiling libc v0.2.155
   Compiling memchr v2.5.0
   Compiling std v0.0.0 (/home/nora/.rustup/toolchains/nightly-2024-08-02-x86_64-unknown-linux-gnu/lib/rustlib/src/rust/library/std)
    Checking rustc-std-workspace-core v1.99.0 (/home/nora/.rustup/toolchains/nightly-2024-08-02-x86_64-unknown-linux-gnu/lib/rustlib/src/rust/library/rustc-std-workspace-core)
    Checking alloc v0.0.0 (/home/nora/.rustup/toolchains/nightly-2024-08-02-x86_64-unknown-linux-gnu/lib/rustlib/src/rust/library/alloc)
    Checking cfg-if v1.0.0
    Checking adler v1.0.2
    Checking rustc-demangle v0.1.24
    Checking unwind v0.0.0 (/home/nora/.rustup/toolchains/nightly-2024-08-02-x86_64-unknown-linux-gnu/lib/rustlib/src/rust/library/unwind)
    Checking rustc-std-workspace-alloc v1.99.0 (/home/nora/.rustup/toolchains/nightly-2024-08-02-x86_64-unknown-linux-gnu/lib/rustlib/src/rust/library/rustc-std-workspace-alloc)
    Checking panic_unwind v0.0.0 (/home/nora/.rustup/toolchains/nightly-2024-08-02-x86_64-unknown-linux-gnu/lib/rustlib/src/rust/library/panic_unwind)
    Checking panic_abort v0.0.0 (/home/nora/.rustup/toolchains/nightly-2024-08-02-x86_64-unknown-linux-gnu/lib/rustlib/src/rust/library/panic_abort)
    Checking gimli v0.29.0
    Checking hashbrown v0.14.5
    Checking miniz_oxide v0.7.4
    Checking std_detect v0.1.5 (/home/nora/.rustup/toolchains/nightly-2024-08-02-x86_64-unknown-linux-gnu/lib/rustlib/src/rust/library/stdarch/crates/std_detect)
    Checking object v0.36.2
    Checking addr2line v0.22.0
error[E0425]: cannot find function `getauxval` in crate `libc`
   --> /home/nora/.rustup/toolchains/nightly-2024-08-02-x86_64-unknown-linux-gnu/lib/rustlib/src/rust/library/std/src/sys/pal/unix/stack_overflow.rs:270:47
    |
270 |         let dynamic_sigstksz = unsafe { libc::getauxval(AT_MINSIGSTKSZ) };
    |                                               ^^^^^^^^^ not found in `libc`

error[E0599]: no method named `si_pid` found for struct `libc::siginfo_t` in the current scope
  --> /home/nora/.rustup/toolchains/nightly-2024-08-02-x86_64-unknown-linux-gnu/lib/rustlib/src/rust/library/std/src/sys/pal/unix/linux/pidfd.rs:47:29
   |
47 |         if unsafe { siginfo.si_pid() } == 0 {
   |                             ^^^^^^ method not found in `siginfo_t`

error[E0599]: no method named `si_status` found for struct `libc::siginfo_t` in the current scope
   --> /home/nora/.rustup/toolchains/nightly-2024-08-02-x86_64-unknown-linux-gnu/lib/rustlib/src/rust/library/std/src/sys/pal/unix/process/process_unix.rs:987:39
    |
987 |         let status = unsafe { siginfo.si_status() };
    |                                       ^^^^^^^^^ method not found in `siginfo_t`

Some errors have detailed explanations: E0425, E0599.
For more information about an error, try `rustc --explain E0425`.
error: could not compile `std` (lib) due to 3 previous errors
fatal error: failed to build sysroot: sysroot build failed